Mantis Issue Tracking for Scribus
· Hosting provided by Anduin.net / Øverby Consulting ·

View Issue Details Jump to Notes ] Issue History ] Print ]
IDProjectCategoryView StatusDate SubmittedLast Update
0008077ScribusBuild Systempublic09-May-25 20:4909-May-26 22:21
ReporterTomZ 
Assigned Topierremarchand 
PrioritynormalSeverityminorReproducibilityN/A
StatusclosedResolutionfixed 
PlatformLinuxOSOpenSuseOS Version11.1
Product Version1.5.0svn 
Target Version1.5.0Fixed in Version1.3.5svn 
Summary0008077: Actual SVN version does not compile
Descriptionmake crashes after 33%:

In file included from /home/tom/trunk/Scribus/scribus/ui_helpbrowser.h:24,
                 from /home/tom/trunk/Scribus/scribus/helpbrowser.h:49,
                 from /home/tom/trunk/Scribus/scribus/moc_helpbrowser.cxx:10:
/home/tom/trunk/Scribus/scribus/sctextbrowser.h:12:20: error: QWebView: Datei oder Verzeichnis nicht gefunden
In file included from /home/tom/trunk/Scribus/scribus/ui_helpbrowser.h:24,
                 from /home/tom/trunk/Scribus/scribus/helpbrowser.h:49,
                 from /home/tom/trunk/Scribus/scribus/moc_helpbrowser.cxx:10:
/home/tom/trunk/Scribus/scribus/sctextbrowser.h:15: error: expected class-name before ‘{’ token
In file included from /home/tom/trunk/Scribus/scribus/helpbrowser.h:49,
                 from /home/tom/trunk/Scribus/scribus/moc_helpbrowser.cxx:10:
/home/tom/trunk/Scribus/scribus/ui_helpbrowser.h: In member function ‘void Ui_HelpBrowser::setupUi(QMainWindow*)’:
/home/tom/trunk/Scribus/scribus/ui_helpbrowser.h:72: error: ‘class ScTextBrowser’ has no member named ‘setObjectName’
/home/tom/trunk/Scribus/scribus/ui_helpbrowser.h:74: error: no matching function for call to ‘QGridLayout::addWidget(ScTextBrowser*&, int, int, int, int)’
/usr/include/QtGui/qgridlayout.h:116: note: candidates are: void QGridLayout::addWidget(QWidget*)
/usr/include/QtGui/qgridlayout.h:117: note: void QGridLayout::addWidget(QWidget*, int, int, Qt::Alignment)
/usr/include/QtGui/qgridlayout.h:118: note: void QGridLayout::addWidget(QWidget*, int, int, int, int, Qt::Alignment)
make[2]: *** [scribus/CMakeFiles/scribus.dir/moc_helpbrowser.o] Fehler 1
make[1]: *** [scribus/CMakeFiles/scribus.dir/all] Fehler 2
make: *** [all] Fehler 2
Steps To Reproducesvn co svn://scribus.info/Scribus/trunk [^]
cmake . -DCMAKE_INSTALL_PREFIX:PATH=/opt/scribus/
make
TagsNo tags attached.
Attached Files

- Relationships

-  Notes
(0021809)
plinnell (administrator)
09-May-25 22:54

seems like we are missing cmake checks for Qtwebkit-devel
(0021810)
pierremarchand (reporter)
09-May-25 22:55

Can you tell a bit more about your Qt setup? is QWebkit installed (or built, if self compiled)?
(0021817)
TomZ (reporter)
09-May-26 20:09

Yes, libQtWebKit4 is installed:

rpm -qa | grep -i webkit
libwebkit-1_0-1-1.0.1-4.28
libQtWebKit4-4.5.1-46.1
kde4-webkitpart-4.2.3.svn967285-27.1
libQtWebKit-devel-4.5.1-46.1

- Issue History
Date Modified Username Field Change
09-May-25 20:49 TomZ New Issue
09-May-25 22:54 plinnell Note Added: 0021809
09-May-25 22:54 plinnell Assigned To => cbradney
09-May-25 22:54 plinnell Severity crash => minor
09-May-25 22:54 plinnell Status new => assigned
09-May-25 22:54 plinnell Product Version 1.3.5svn => 1.5.0svn
09-May-25 22:54 plinnell Target Version => 1.5.0
09-May-25 22:55 pierremarchand Note Added: 0021810
09-May-25 23:17 pierremarchand Assigned To cbradney => pierremarchand
09-May-26 20:09 TomZ Note Added: 0021817
09-May-26 22:21 christoph_s Status assigned => resolved
09-May-26 22:21 christoph_s Fixed in Version => 1.3.5svn
09-May-26 22:21 christoph_s Resolution open => fixed
09-May-26 22:21 christoph_s Status resolved => closed



Copyright © 2000 - 2014 MantisBT Team
Powered by Mantis Bugtracker