Mantis Issue Tracking for Scribus
· Hosting provided by Anduin.net / Øverby Consulting ·

View Issue Details Jump to Notes ] Issue History ] Print ]
IDProjectCategoryView StatusDate SubmittedLast Update
0011850ScribusBuild Systempublic2013-11-28 01:222013-11-28 21:32
Reporterchristoph_s 
Assigned Tofschmid 
PrioritynormalSeverityminorReproducibilityalways
StatusclosedResolutionfixed 
Platformx86_64OSOpenSUSE 64 BitOS Version13.1
Product Version1.5.0svn 
Target Version1.5.0Fixed in Version1.5.0svn 
Summary0011850: Build error with r18605
DescriptionSince r18605 building fails with the following error (also reported on the ML):

Scanning dependencies of target scribus_zip_lib
[ 0%] Building CXX object scribus/third_party/zip/CMakeFiles/scribus_zip_lib.dir/unzip.cpp.o
[ 0%] Building CXX object scribus/third_party/zip/CMakeFiles/scribus_zip_lib.dir/zip.cpp.o
/home/christoph/scribus15/Scribus/scribus/third_party/zip/zip.cpp: In constructor ‘ZipPrivate::ZipPrivate()’:
/home/christoph/scribus15/Scribus/scribus/third_party/zip/zip.cpp:286:14: error: cannot convert ‘const z_crc_t* {aka const unsigned int*}’ to ‘const crc_t* {aka const long unsigned int*}’ in assignment
     crcTable = get_crc_table();
              ^
make[2]: *** [scribus/third_party/zip/CMakeFiles/scribus_zip_lib.dir/zip.cpp.o] Fehler 1
make[1]: *** [scribus/third_party/zip/CMakeFiles/scribus_zip_lib.dir/all] Fehler 2
make: *** [all] Fehler 2
TagsNo tags attached.
Patch
Attached Files

- Relationships

-  Notes
(0030874)
fschmid (administrator)
2013-11-28 07:39

Please try r18606 (current trunk)
(0030875)
christoph_s (administrator)
2013-11-28 08:33

I did. Result as above.
(0030878)
fschmid (administrator)
2013-11-28 20:21

r18607 should work again. Previous breakage on my side was caused by the outdated zlib on Suse 11.3

- Issue History
Date Modified Username Field Change
2013-11-28 01:22 christoph_s New Issue
2013-11-28 01:22 christoph_s Status new => assigned
2013-11-28 01:22 christoph_s Assigned To => fschmid
2013-11-28 01:23 christoph_s Summary Build error with r18606 => Build error with r18605
2013-11-28 01:23 christoph_s Description Updated View Revisions
2013-11-28 07:39 fschmid Note Added: 0030874
2013-11-28 08:33 christoph_s Note Added: 0030875
2013-11-28 19:54 fschmid Note Added: 0030877
2013-11-28 19:55 fschmid Note Deleted: 0030877
2013-11-28 20:21 fschmid Note Added: 0030878
2013-11-28 21:32 cbradney Status assigned => closed
2013-11-28 21:32 cbradney Resolution open => fixed
2013-11-28 21:32 cbradney Fixed in Version => 1.5.0svn



Copyright © 2000 - 2014 MantisBT Team
Powered by Mantis Bugtracker